{"text_format":"1","workbook":"xlsx","n_sheets":8,"sheets":["MUŽI PHL","ŽENY PHL","MUŽI MIMO PHL","ŽENY MIMO PHL","PS 8","PLAY OFF","CELKOVÁ","List1"],"not_rendered":{"charts":0,"images":0,"macros":1,"external_links":0,"defined_names":20,"comments":0,"pivot_tables":0},"unopened":[],"bounds":{"document_bytes":16777216,"sheet_cells":100000,"rows_first":2000,"rows_last":500,"rows_between":2000,"halvings":0,"cell_chars":16384,"cell_head_chars":4096},"cells_cut":0,"cells_raw":0,"read":"whole","date_system":"1900"}

{"sheet":"MUŽI PHL","index":0,"n_rows":42,"n_cols":9,"rows_kept":42,"cut":false,"hidden":false,"merged":[[15,7,18,7],[0,5,0,6],[0,0,0,1],[0,2,0,4]]}
[{"$f":"MIN(E3:E42)","v":18.850000000000001},null,{"$f":"INDIRECT(I3)","v":"Kletečná B"},null,null,"MUŽI"]
["No.","TÝM","LEVÝ PROUD","PRAVÝ PROUD","CELKOVÝ ČAS","POŘADÍ","POZNÁMKA",null,{"$f":"MATCH(1,F3:F42,0)+2","v":3}]
[6,"Kletečná B",18.02,18.850000000000001,{"$f":"IF(OR(ISBLANK(C3),ISBLANK(#REF!)),\" \",MAX(C3:D3))","v":18.850000000000001},{"$f":"IF(OR(ISBLANK(C3),ISBLANK(#REF!)),\" \",RANK(E3,$E$3:$E$42,1))","v":1},null,null,{"$f":"ADDRESS(I2,2)","v":"$B$3"}]
[2,"Přáslavice A",19.22,18.77,{"$f":"IF(OR(ISBLANK(C4),ISBLANK(#REF!)),\" \",MAX(C4:D4))","v":19.22},{"$f":"IF(OR(ISBLANK(C4),ISBLANK(#REF!)),\" \",RANK(E4,$E$3:$E$42,1))","v":2}]
[3,"Přáslavice B",19.489999999999998,19.41,{"$f":"IF(OR(ISBLANK(C5),ISBLANK(#REF!)),\" \",MAX(C5:D5))","v":19.489999999999998},{"$f":"IF(OR(ISBLANK(C5),ISBLANK(#REF!)),\" \",RANK(E5,$E$3:$E$42,1))","v":3}]
[9,"Jiřice A",19.37,19.5,{"$f":"IF(OR(ISBLANK(C6),ISBLANK(#REF!)),\" \",MAX(C6:D6))","v":19.5},{"$f":"IF(OR(ISBLANK(C6),ISBLANK(#REF!)),\" \",RANK(E6,$E$3:$E$42,1))","v":4}]
[4,"Salačova Lhota",19.95,20.190000000000001,{"$f":"IF(OR(ISBLANK(C7),ISBLANK(#REF!)),\" \",MAX(C7:D7))","v":20.190000000000001},{"$f":"IF(OR(ISBLANK(C7),ISBLANK(#REF!)),\" \",RANK(E7,$E$3:$E$42,1))","v":5}]
[12,"Bácovice",19.989999999999998,20.41,{"$f":"IF(OR(ISBLANK(C8),ISBLANK(#REF!)),\" \",MAX(C8:D8))","v":20.41},{"$f":"IF(OR(ISBLANK(C8),ISBLANK(#REF!)),\" \",RANK(E8,$E$3:$E$42,1))","v":6}]
[10,"Červená Řečice",20.55,20.420000000000002,{"$f":"IF(OR(ISBLANK(C9),ISBLANK(#REF!)),\" \",MAX(C9:D9))","v":20.55},{"$f":"IF(OR(ISBLANK(C9),ISBLANK(#REF!)),\" \",RANK(E9,$E$3:$E$42,1))","v":7}]
[5,"Kletečná A",20.64,20.78,{"$f":"IF(OR(ISBLANK(C10),ISBLANK(#REF!)),\" \",MAX(C10:D10))","v":20.78},{"$f":"IF(OR(ISBLANK(C10),ISBLANK(#REF!)),\" \",RANK(E10,$E$3:$E$42,1))","v":8}]
[11,"Jiřice B",24.31,25.55,{"$f":"IF(OR(ISBLANK(C11),ISBLANK(#REF!)),\" \",MAX(C11:D11))","v":25.55},{"$f":"IF(OR(ISBLANK(C11),ISBLANK(#REF!)),\" \",RANK(E11,$E$3:$E$42,1))","v":9}]
[7,"Samšín",37.840000000000003,36.43,{"$f":"IF(OR(ISBLANK(C12),ISBLANK(#REF!)),\" \",MAX(C12:D12))","v":37.840000000000003},{"$f":"IF(OR(ISBLANK(C12),ISBLANK(#REF!)),\" \",RANK(E12,$E$3:$E$42,1))","v":10}]
[1,"Hněvkovice A",99,99,{"$f":"IF(OR(ISBLANK(C13),ISBLANK(#REF!)),\" \",MAX(C13:D13))","v":99},{"$f":"IF(OR(ISBLANK(C13),ISBLANK(#REF!)),\" \",RANK(E13,$E$3:$E$42,1))","v":11},"NEHODNOCENO"]
[8,"Pacov",99.5,99.5,{"$f":"IF(OR(ISBLANK(C14),ISBLANK(#REF!)),\" \",MAX(C14:D14))","v":99.5},{"$f":"IF(OR(ISBLANK(C14),ISBLANK(#REF!)),\" \",RANK(E14,$E$3:$E$42,1))","v":12},"NEHODNOCENO"]
[13,null,null,{"$f":"IF(ISBLANK(C15),\" \",C15)","v":" "},{"$f":"IF(OR(ISBLANK(C15),ISBLANK(#REF!)),\" \",MAX(C15:D15))","v":" "},{"$f":"IF(OR(ISBLANK(C15),ISBLANK(#REF!)),\" \",RANK(E15,$E$3:$E$42,1))","v":" "}]
[14,null,null,{"$f":"IF(ISBLANK(C16),\" \",C16)","v":" "},{"$f":"IF(OR(ISBLANK(C16),ISBLANK(#REF!)),\" \",MAX(C16:D16))","v":" "},{"$f":"IF(OR(ISBLANK(C16),ISBLANK(#REF!)),\" \",RANK(E16,$E$3:$E$42,1))","v":" "}]
[15,null,null,{"$f":"IF(ISBLANK(C17),\" \",C17)","v":" "},{"$f":"IF(OR(ISBLANK(C17),ISBLANK(#REF!)),\" \",MAX(C17:D17))","v":" "},{"$f":"IF(OR(ISBLANK(C17),ISBLANK(#REF!)),\" \",RANK(E17,$E$3:$E$42,1))","v":" "}]
[16,null,null,{"$f":"IF(ISBLANK(C18),\" \",C18)","v":" "},{"$f":"IF(OR(ISBLANK(C18),ISBLANK(D18)),\" \",MAX(C18:D18))","v":" "},{"$f":"IF(OR(ISBLANK(C18),ISBLANK(#REF!)),\" \",RANK(E18,$E$3:$E$42,1))","v":" "}]
[17,null,null,{"$f":"IF(ISBLANK(C19),\" \",C19)","v":" "},{"$f":"IF(OR(ISBLANK(C19),ISBLANK(D19)),\" \",MAX(C19:D19))","v":" "},{"$f":"IF(OR(ISBLANK(C19),ISBLANK(#REF!)),\" \",RANK(E19,$E$3:$E$42,1))","v":" "}]
[18,null,null,{"$f":"IF(ISBLANK(C20),\" \",C20)","v":" "},{"$f":"IF(OR(ISBLANK(C20),ISBLANK(D20)),\" \",MAX(C20:D20))","v":" "},{"$f":"IF(OR(ISBLANK(C20),ISBLANK(#REF!)),\" \",RANK(E20,$E$3:$E$42,1))","v":" "}]
[19,null,null,{"$f":"IF(ISBLANK(C21),\" \",C21)","v":" "},{"$f":"IF(OR(ISBLANK(C21),ISBLANK(D21)),\" \",MAX(C21:D21))","v":" "},{"$f":"IF(OR(ISBLANK(C21),ISBLANK(D21)),\" \",RANK(E21,$E$3:$E$42,1))","v":" "}]
[20,null,null,{"$f":"IF(ISBLANK(C22),\" \",C22)","v":" "},{"$f":"IF(OR(ISBLANK(C22),ISBLANK(D22)),\" \",MAX(C22:D22))","v":" "},{"$f":"IF(OR(ISBLANK(C22),ISBLANK(D22)),\" \",RANK(E22,$E$3:$E$42,1))","v":" "}]
[21,null,null,{"$f":"IF(ISBLANK(C23),\" \",C23)","v":" "},{"$f":"IF(OR(ISBLANK(C23),ISBLANK(D23)),\" \",MAX(C23:D23))","v":" "},{"$f":"IF(OR(ISBLANK(C23),ISBLANK(D23)),\" \",RANK(E23,$E$3:$E$42,1))","v":" "}]
[22,null,null,{"$f":"IF(ISBLANK(C24),\" \",C24)","v":" "},{"$f":"IF(OR(ISBLANK(C24),ISBLANK(D24)),\" \",MAX(C24:D24))","v":" "},{"$f":"IF(OR(ISBLANK(C24),ISBLANK(D24)),\" \",RANK(E24,$E$3:$E$42,1))","v":" "}]
[23,null,null,{"$f":"IF(ISBLANK(C25),\" \",C25)","v":" "},{"$f":"IF(OR(ISBLANK(C25),ISBLANK(D25)),\" \",MAX(C25:D25))","v":" "},{"$f":"IF(OR(ISBLANK(C25),ISBLANK(D25)),\" \",RANK(E25,$E$3:$E$42,1))","v":" "}]
[24,null,null,{"$f":"IF(ISBLANK(C26),\" \",C26)","v":" "},{"$f":"IF(OR(ISBLANK(C26),ISBLANK(D26)),\" \",MAX(C26:D26))","v":" "},{"$f":"IF(OR(ISBLANK(C26),ISBLANK(D26)),\" \",RANK(E26,$E$3:$E$42,1))","v":" "}]
[25,null,null,{"$f":"IF(ISBLANK(C27),\" \",C27)","v":" "},{"$f":"IF(OR(ISBLANK(C27),ISBLANK(D27)),\" \",MAX(C27:D27))","v":" "},{"$f":"IF(OR(ISBLANK(C27),ISBLANK(D27)),\" \",RANK(E27,$E$3:$E$42,1))","v":" "}]
[26,null,null,{"$f":"IF(ISBLANK(C28),\" \",C28)","v":" "},{"$f":"IF(OR(ISBLANK(C28),ISBLANK(D28)),\" \",MAX(C28:D28))","v":" "},{"$f":"IF(OR(ISBLANK(C28),ISBLANK(D28)),\" \",RANK(E28,$E$3:$E$42,1))","v":" "}]
[27,null,null,{"$f":"IF(ISBLANK(C29),\" \",C29)","v":" "},{"$f":"IF(OR(ISBLANK(C29),ISBLANK(D29)),\" \",MAX(C29:D29))","v":" "},{"$f":"IF(OR(ISBLANK(C29),ISBLANK(D29)),\" \",RANK(E29,$E$3:$E$42,1))","v":" "}]
[28,null,null,{"$f":"IF(ISBLANK(C30),\" \",C30)","v":" "},{"$f":"IF(OR(ISBLANK(C30),ISBLANK(D30)),\" \",MAX(C30:D30))","v":" "},{"$f":"IF(OR(ISBLANK(C30),ISBLANK(D30)),\" \",RANK(E30,$E$3:$E$42,1))","v":" "}]
[29,null,null,{"$f":"IF(ISBLANK(C31),\" \",C31)","v":" "},{"$f":"IF(OR(ISBLANK(C31),ISBLANK(D31)),\" \",MAX(C31:D31))","v":" "},{"$f":"IF(OR(ISBLANK(C31),ISBLANK(D31)),\" \",RANK(E31,$E$3:$E$42,1))","v":" "}]
[30,null,null,{"$f":"IF(ISBLANK(C32),\" \",C32)","v":" "},{"$f":"IF(OR(ISBLANK(C32),ISBLANK(D32)),\" \",MAX(C32:D32))","v":" "},{"$f":"IF(OR(ISBLANK(C32),ISBLANK(D32)),\" \",RANK(E32,$E$3:$E$42,1))","v":" "}]
[31,null,null,{"$f":"IF(ISBLANK(C33),\" \",C33)","v":" "},{"$f":"IF(OR(ISBLANK(C33),ISBLANK(D33)),\" \",MAX(C33:D33))","v":" "},{"$f":"IF(OR(ISBLANK(C33),ISBLANK(D33)),\" \",RANK(E33,$E$3:$E$42,1))","v":" "}]
[32,null,null,{"$f":"IF(ISBLANK(C34),\" \",C34)","v":" "},{"$f":"IF(OR(ISBLANK(C34),ISBLANK(D34)),\" \",MAX(C34:D34))","v":" "},{"$f":"IF(OR(ISBLANK(C34),ISBLANK(D34)),\" \",RANK(E34,$E$3:$E$42,1))","v":" "}]
[33,null,null,{"$f":"IF(ISBLANK(C35),\" \",C35)","v":" "},{"$f":"IF(OR(ISBLANK(C35),ISBLANK(D35)),\" \",MAX(C35:D35))","v":" "},{"$f":"IF(OR(ISBLANK(C35),ISBLANK(D35)),\" \",RANK(E35,$E$3:$E$42,1))","v":" "}]
[34,null,null,{"$f":"IF(ISBLANK(C36),\" \",C36)","v":" "},{"$f":"IF(OR(ISBLANK(C36),ISBLANK(D36)),\" \",MAX(C36:D36))","v":" "},{"$f":"IF(OR(ISBLANK(C36),ISBLANK(D36)),\" \",RANK(E36,$E$3:$E$42,1))","v":" "}]
[35,null,null,{"$f":"IF(ISBLANK(C37),\" \",C37)","v":" "},{"$f":"IF(OR(ISBLANK(C37),ISBLANK(D37)),\" \",MAX(C37:D37))","v":" "},{"$f":"IF(OR(ISBLANK(C37),ISBLANK(D37)),\" \",RANK(E37,$E$3:$E$42,1))","v":" "}]
[36,null,null,{"$f":"IF(ISBLANK(C38),\" \",C38)","v":" "},{"$f":"IF(OR(ISBLANK(C38),ISBLANK(D38)),\" \",MAX(C38:D38))","v":" "},{"$f":"IF(OR(ISBLANK(C38),ISBLANK(D38)),\" \",RANK(E38,$E$3:$E$42,1))","v":" "}]
[37,null,null,{"$f":"IF(ISBLANK(C39),\" \",C39)","v":" "},{"$f":"IF(OR(ISBLANK(C39),ISBLANK(D39)),\" \",MAX(C39:D39))","v":" "},{"$f":"IF(OR(ISBLANK(C39),ISBLANK(D39)),\" \",RANK(E39,$E$3:$E$42,1))","v":" "}]
[38,null,null,{"$f":"IF(ISBLANK(C40),\" \",C40)","v":" "},{"$f":"IF(OR(ISBLANK(C40),ISBLANK(D40)),\" \",MAX(C40:D40))","v":" "},{"$f":"IF(OR(ISBLANK(C40),ISBLANK(D40)),\" \",RANK(E40,$E$3:$E$42,1))","v":" "}]
[39,null,null,{"$f":"IF(ISBLANK(C41),\" \",C41)","v":" "},{"$f":"IF(OR(ISBLANK(C41),ISBLANK(D41)),\" \",MAX(C41:D41))","v":" "},{"$f":"IF(OR(ISBLANK(C41),ISBLANK(D41)),\" \",RANK(E41,$E$3:$E$42,1))","v":" "}]
[40,null,null,{"$f":"IF(ISBLANK(C42),\" \",C42)","v":" "},{"$f":"IF(OR(ISBLANK(C42),ISBLANK(D42)),\" \",MAX(C42:D42))","v":" "},{"$f":"IF(OR(ISBLANK(C42),ISBLANK(D42)),\" \",RANK(E42,$E$3:$E$42,1))","v":" "}]

{"sheet":"ŽENY PHL","index":1,"n_rows":42,"n_cols":9,"rows_kept":42,"cut":false,"hidden":false,"merged":[[0,0,0,1],[0,2,0,4],[0,5,0,6],[15,7,18,7]]}
[{"$f":"MIN(E3:E42)","v":0},null,{"$f":"INDIRECT(I3)","v":"  "},null,null,"MUŽI"]
["No.","TÝM","LEVÝ PROUD","PRAVÝ PROUD","CELKOVÝ ČAS","POŘADÍ","POZNÁMKA",null,{"$f":"MATCH(1,F3:F42,0)+2","v":3}]
[1,"  ",0,null,{"$f":"IF(OR(ISBLANK(C3),ISBLANK(#REF!)),\" \",MAX(C3:D3))","v":0},{"$f":"IF(OR(ISBLANK(C3),ISBLANK(#REF!)),\" \",RANK(E3,$E$3:$E$42,1))","v":1},null,null,{"$f":"ADDRESS(I2,2)","v":"$B$3"}]
[2,null,null,{"$f":"IF(ISBLANK(C4),\" \",C4)","v":" "},{"$f":"IF(OR(ISBLANK(C4),ISBLANK(#REF!)),\" \",MAX(C4:D4))","v":" "},{"$f":"IF(OR(ISBLANK(C4),ISBLANK(#REF!)),\" \",RANK(E4,$E$3:$E$42,1))","v":" "}]
[3,null,null," ",{"$f":"IF(OR(ISBLANK(C5),ISBLANK(#REF!)),\" \",MAX(C5:D5))","v":" "},{"$f":"IF(OR(ISBLANK(C5),ISBLANK(#REF!)),\" \",RANK(E5,$E$3:$E$42,1))","v":" "}]
[4,null,null," ",{"$f":"IF(OR(ISBLANK(C6),ISBLANK(#REF!)),\" \",MAX(C6:D6))","v":" "},{"$f":"IF(OR(ISBLANK(C6),ISBLANK(#REF!)),\" \",RANK(E6,$E$3:$E$42,1))","v":" "}]
[5,null,null," ",{"$f":"IF(OR(ISBLANK(C7),ISBLANK(#REF!)),\" \",MAX(C7:D7))","v":" "},{"$f":"IF(OR(ISBLANK(C7),ISBLANK(#REF!)),\" \",RANK(E7,$E$3:$E$42,1))","v":" "}]
[6,null,null," ",{"$f":"IF(OR(ISBLANK(C8),ISBLANK(#REF!)),\" \",MAX(C8:D8))","v":" "},{"$f":"IF(OR(ISBLANK(C8),ISBLANK(#REF!)),\" \",RANK(E8,$E$3:$E$42,1))","v":" "}]
[7,null,null," ",{"$f":"IF(OR(ISBLANK(C9),ISBLANK(#REF!)),\" \",MAX(C9:D9))","v":" "},{"$f":"IF(OR(ISBLANK(C9),ISBLANK(#REF!)),\" \",RANK(E9,$E$3:$E$42,1))","v":" "}]
[8,null,null," ",{"$f":"IF(OR(ISBLANK(C10),ISBLANK(#REF!)),\" \",MAX(C10:D10))","v":" "},{"$f":"IF(OR(ISBLANK(C10),ISBLANK(#REF!)),\" \",RANK(E10,$E$3:$E$42,1))","v":" "}]
[9,null,null," ",{"$f":"IF(OR(ISBLANK(C11),ISBLANK(#REF!)),\" \",MAX(C11:D11))","v":" "},{"$f":"IF(OR(ISBLANK(C11),ISBLANK(#REF!)),\" \",RANK(E11,$E$3:$E$42,1))","v":" "}]
[10,null,null," ",{"$f":"IF(OR(ISBLANK(C12),ISBLANK(#REF!)),\" \",MAX(C12:D12))","v":" "},{"$f":"IF(OR(ISBLANK(C12),ISBLANK(#REF!)),\" \",RANK(E12,$E$3:$E$42,1))","v":" "}]
[11,null,null," ",{"$f":"IF(OR(ISBLANK(C13),ISBLANK(#REF!)),\" \",MAX(C13:D13))","v":" "},{"$f":"IF(OR(ISBLANK(C13),ISBLANK(#REF!)),\" \",RANK(E13,$E$3:$E$42,1))","v":" "}]
[12,null,null," ",{"$f":"IF(OR(ISBLANK(C14),ISBLANK(#REF!)),\" \",MAX(C14:D14))","v":" "},{"$f":"IF(OR(ISBLANK(C14),ISBLANK(#REF!)),\" \",RANK(E14,$E$3:$E$42,1))","v":" "}]
[13,null,null," ",{"$f":"IF(OR(ISBLANK(C15),ISBLANK(#REF!)),\" \",MAX(C15:D15))","v":" "},{"$f":"IF(OR(ISBLANK(C15),ISBLANK(#REF!)),\" \",RANK(E15,$E$3:$E$42,1))","v":" "}]
[14,null,null," ",{"$f":"IF(OR(ISBLANK(C16),ISBLANK(#REF!)),\" \",MAX(C16:D16))","v":" "},{"$f":"IF(OR(ISBLANK(C16),ISBLANK(#REF!)),\" \",RANK(E16,$E$3:$E$42,1))","v":" "}]
[15,null,null," ",{"$f":"IF(OR(ISBLANK(C17),ISBLANK(#REF!)),\" \",MAX(C17:D17))","v":" "},{"$f":"IF(OR(ISBLANK(C17),ISBLANK(#REF!)),\" \",RANK(E17,$E$3:$E$42,1))","v":" "}]
[16,null,null," ",{"$f":"IF(OR(ISBLANK(C18),ISBLANK(D18)),\" \",MAX(C18:D18))","v":" "},{"$f":"IF(OR(ISBLANK(C18),ISBLANK(#REF!)),\" \",RANK(E18,$E$3:$E$42,1))","v":" "}]
[17,null,null," "," ",{"$f":"IF(OR(ISBLANK(C19),ISBLANK(#REF!)),\" \",RANK(E19,$E$3:$E$42,1))","v":" "}]
[18,null,null," "," ",{"$f":"IF(OR(ISBLANK(C20),ISBLANK(#REF!)),\" \",RANK(E20,$E$3:$E$42,1))","v":" "}]
[19,null,null," "," ",{"$f":"IF(OR(ISBLANK(C21),ISBLANK(D21)),\" \",RANK(E21,$E$3:$E$42,1))","v":" "}]
[20,null,null," "," "," "]
[21,null,null," "," "," "]
[22,null,null," "," "," "]
[23,null,null," "," "," "]
[24,null,null," "," "," "]
[25,null,null," "," "," "]
[26,null,null," "," "," "]
[27,null,null," "," "," "]
[28,null,null," "," "," "]
[29,null,null," "," "," "]
[30,null,null," "," "," "]
[31,null,null," "," "," "]
[32,null,null," "," "," "]
[33,null,null," "," "," "]
[34,null,null," "," "," "]
[35,null,null," "," "," "]
[36,null,null," "," "," "]
[37,null,null," "," "," "]
[38,null,null," "," "," "]
[39,null,null," "," "," "]
[40,null,null," "," "," "]

{"sheet":"MUŽI MIMO PHL","index":2,"n_rows":42,"n_cols":9,"rows_kept":42,"cut":false,"hidden":false,"merged":[[0,0,0,1],[0,2,0,4],[0,5,0,6],[15,7,18,7]]}
[{"$f":"MIN(E3:E42)","v":22.81},null,{"$f":"INDIRECT(I3)","v":"Hněvkovice B"},null,null,"MUŽI"]
["No.","TÝM","LEVÝ PROUD","PRAVÝ PROUD","CELKOVÝ ČAS","POŘADÍ","POZNÁMKA",null,{"$f":"MATCH(1,F3:F42,0)+2","v":3}]
[1,"Hněvkovice B",22.81,22.72,{"$f":"IF(OR(ISBLANK(C3),ISBLANK(#REF!)),\" \",MAX(C3:D3))","v":22.81},{"$f":"IF(OR(ISBLANK(C3),ISBLANK(#REF!)),\" \",RANK(E3,$E$3:$E$42,1))","v":1},null,null,{"$f":"ADDRESS(I2,2)","v":"$B$3"}]
[2,"Putimov",99,22.34,{"$f":"IF(OR(ISBLANK(C4),ISBLANK(#REF!)),\" \",MAX(C4:D4))","v":99},{"$f":"IF(OR(ISBLANK(C4),ISBLANK(#REF!)),\" \",RANK(E4,$E$3:$E$42,1))","v":2},"Nehodnoceno"]
[3,"Horní Němčice",99.9,99.9,{"$f":"IF(OR(ISBLANK(C5),ISBLANK(#REF!)),\" \",MAX(C5:D5))","v":99.9},{"$f":"IF(OR(ISBLANK(C5),ISBLANK(#REF!)),\" \",RANK(E5,$E$3:$E$42,1))","v":3},"Nedokončeno"]
[4,null,null,{"$f":"IF(ISBLANK(C6),\" \",C6)","v":" "},{"$f":"IF(OR(ISBLANK(C6),ISBLANK(#REF!)),\" \",MAX(C6:D6))","v":" "},{"$f":"IF(OR(ISBLANK(C6),ISBLANK(#REF!)),\" \",RANK(E6,$E$3:$E$42,1))","v":" "}]
[5,null,null," ",{"$f":"IF(OR(ISBLANK(C7),ISBLANK(#REF!)),\" \",MAX(C7:D7))","v":" "},{"$f":"IF(OR(ISBLANK(C7),ISBLANK(#REF!)),\" \",RANK(E7,$E$3:$E$42,1))","v":" "}]
[6,null,null," ",{"$f":"IF(OR(ISBLANK(C8),ISBLANK(#REF!)),\" \",MAX(C8:D8))","v":" "},{"$f":"IF(OR(ISBLANK(C8),ISBLANK(#REF!)),\" \",RANK(E8,$E$3:$E$42,1))","v":" "}]
[7,null,null," ",{"$f":"IF(OR(ISBLANK(C9),ISBLANK(#REF!)),\" \",MAX(C9:D9))","v":" "},{"$f":"IF(OR(ISBLANK(C9),ISBLANK(#REF!)),\" \",RANK(E9,$E$3:$E$42,1))","v":" "}]
[8,null,null," ",{"$f":"IF(OR(ISBLANK(C10),ISBLANK(#REF!)),\" \",MAX(C10:D10))","v":" "},{"$f":"IF(OR(ISBLANK(C10),ISBLANK(#REF!)),\" \",RANK(E10,$E$3:$E$42,1))","v":" "}]
[9,null,null," ",{"$f":"IF(OR(ISBLANK(C11),ISBLANK(#REF!)),\" \",MAX(C11:D11))","v":" "},{"$f":"IF(OR(ISBLANK(C11),ISBLANK(#REF!)),\" \",RANK(E11,$E$3:$E$42,1))","v":" "}]
[10,null,null," ",{"$f":"IF(OR(ISBLANK(C12),ISBLANK(#REF!)),\" \",MAX(C12:D12))","v":" "},{"$f":"IF(OR(ISBLANK(C12),ISBLANK(#REF!)),\" \",RANK(E12,$E$3:$E$42,1))","v":" "}]
[11,null,null," ",{"$f":"IF(OR(ISBLANK(C13),ISBLANK(#REF!)),\" \",MAX(C13:D13))","v":" "},{"$f":"IF(OR(ISBLANK(C13),ISBLANK(#REF!)),\" \",RANK(E13,$E$3:$E$42,1))","v":" "}]
[12,null,null," ",{"$f":"IF(OR(ISBLANK(C14),ISBLANK(#REF!)),\" \",MAX(C14:D14))","v":" "},{"$f":"IF(OR(ISBLANK(C14),ISBLANK(#REF!)),\" \",RANK(E14,$E$3:$E$42,1))","v":" "}]
[13,null,null," ",{"$f":"IF(OR(ISBLANK(C15),ISBLANK(#REF!)),\" \",MAX(C15:D15))","v":" "},{"$f":"IF(OR(ISBLANK(C15),ISBLANK(#REF!)),\" \",RANK(E15,$E$3:$E$42,1))","v":" "}]
[14,null,null," ",{"$f":"IF(OR(ISBLANK(C16),ISBLANK(#REF!)),\" \",MAX(C16:D16))","v":" "},{"$f":"IF(OR(ISBLANK(C16),ISBLANK(#REF!)),\" \",RANK(E16,$E$3:$E$42,1))","v":" "}]
[15,null,null," ",{"$f":"IF(OR(ISBLANK(C17),ISBLANK(#REF!)),\" \",MAX(C17:D17))","v":" "},{"$f":"IF(OR(ISBLANK(C17),ISBLANK(#REF!)),\" \",RANK(E17,$E$3:$E$42,1))","v":" "}]
[16,null,null," ",{"$f":"IF(OR(ISBLANK(C18),ISBLANK(D18)),\" \",MAX(C18:D18))","v":" "},{"$f":"IF(OR(ISBLANK(C18),ISBLANK(#REF!)),\" \",RANK(E18,$E$3:$E$42,1))","v":" "}]
[17,null,null," "," ",{"$f":"IF(OR(ISBLANK(C19),ISBLANK(#REF!)),\" \",RANK(E19,$E$3:$E$42,1))","v":" "}]
[18,null,null," "," ",{"$f":"IF(OR(ISBLANK(C20),ISBLANK(#REF!)),\" \",RANK(E20,$E$3:$E$42,1))","v":" "}]
[19,null,null," "," ",{"$f":"IF(OR(ISBLANK(C21),ISBLANK(D21)),\" \",RANK(E21,$E$3:$E$42,1))","v":" "}]
[20,null,null," "," "," "]
[21,null,null," "," "," "]
[22,null,null," "," "," "]
[23,null,null," "," "," "]
[24,null,null," "," "," "]
[25,null,null," "," "," "]
[26,null,null," "," "," "]
[27,null,null," "," "," "]
[28,null,null," "," "," "]
[29,null,null," "," "," "]
[30,null,null," "," "," "]
[31,null,null," "," "," "]
[32,null,null," "," "," "]
[33,null,null," "," "," "]
[34,null,null," "," "," "]
[35,null,null," "," "," "]
[36,null,null," "," "," "]
[37,null,null," "," "," "]
[38,null,null," "," "," "]
[39,null,null," "," "," "]
[40,null,null," "," "," "]

{"sheet":"ŽENY MIMO PHL","index":3,"n_rows":42,"n_cols":9,"rows_kept":42,"cut":false,"hidden":false,"merged":[[0,0,0,1],[0,2,0,4],[0,5,0,6],[15,7,18,7]]}
[{"$f":"MIN(E3:E42)","v":27.28},null,{"$f":"INDIRECT(I3)","v":"Hněvkovice"},null,null,"MUŽI"]
["No.","TÝM","LEVÝ PROUD","PRAVÝ PROUD","CELKOVÝ ČAS","POŘADÍ","POZNÁMKA",null,{"$f":"MATCH(1,F3:F42,0)+2","v":3}]
[1,"Hněvkovice",26.95,27.28,{"$f":"IF(OR(ISBLANK(C3),ISBLANK(#REF!)),\" \",MAX(C3:D3))","v":27.28},{"$f":"IF(OR(ISBLANK(C3),ISBLANK(#REF!)),\" \",RANK(E3,$E$3:$E$42,1))","v":1},null,null,{"$f":"ADDRESS(I2,2)","v":"$B$3"}]
[2,"Jiřice",26.5,27.65,{"$f":"IF(OR(ISBLANK(C4),ISBLANK(#REF!)),\" \",MAX(C4:D4))","v":27.65},{"$f":"IF(OR(ISBLANK(C4),ISBLANK(#REF!)),\" \",RANK(E4,$E$3:$E$42,1))","v":2}]
[3,null,null,{"$f":"IF(ISBLANK(C5),\" \",C5)","v":" "},{"$f":"IF(OR(ISBLANK(C5),ISBLANK(#REF!)),\" \",MAX(C5:D5))","v":" "},{"$f":"IF(OR(ISBLANK(C5),ISBLANK(#REF!)),\" \",RANK(E5,$E$3:$E$42,1))","v":" "}]
[4,null,null," ",{"$f":"IF(OR(ISBLANK(C6),ISBLANK(#REF!)),\" \",MAX(C6:D6))","v":" "},{"$f":"IF(OR(ISBLANK(C6),ISBLANK(#REF!)),\" \",RANK(E6,$E$3:$E$42,1))","v":" "}]
[5,null,null," ",{"$f":"IF(OR(ISBLANK(C7),ISBLANK(#REF!)),\" \",MAX(C7:D7))","v":" "},{"$f":"IF(OR(ISBLANK(C7),ISBLANK(#REF!)),\" \",RANK(E7,$E$3:$E$42,1))","v":" "}]
[6,null,null," ",{"$f":"IF(OR(ISBLANK(C8),ISBLANK(#REF!)),\" \",MAX(C8:D8))","v":" "},{"$f":"IF(OR(ISBLANK(C8),ISBLANK(#REF!)),\" \",RANK(E8,$E$3:$E$42,1))","v":" "}]
[7,null,null," ",{"$f":"IF(OR(ISBLANK(C9),ISBLANK(#REF!)),\" \",MAX(C9:D9))","v":" "},{"$f":"IF(OR(ISBLANK(C9),ISBLANK(#REF!)),\" \",RANK(E9,$E$3:$E$42,1))","v":" "}]
[8,null,null," ",{"$f":"IF(OR(ISBLANK(C10),ISBLANK(#REF!)),\" \",MAX(C10:D10))","v":" "},{"$f":"IF(OR(ISBLANK(C10),ISBLANK(#REF!)),\" \",RANK(E10,$E$3:$E$42,1))","v":" "}]
[9,null,null," ",{"$f":"IF(OR(ISBLANK(C11),ISBLANK(#REF!)),\" \",MAX(C11:D11))","v":" "},{"$f":"IF(OR(ISBLANK(C11),ISBLANK(#REF!)),\" \",RANK(E11,$E$3:$E$42,1))","v":" "}]
[10,null,null," ",{"$f":"IF(OR(ISBLANK(C12),ISBLANK(#REF!)),\" \",MAX(C12:D12))","v":" "},{"$f":"IF(OR(ISBLANK(C12),ISBLANK(#REF!)),\" \",RANK(E12,$E$3:$E$42,1))","v":" "}]
[11,null,null," ",{"$f":"IF(OR(ISBLANK(C13),ISBLANK(#REF!)),\" \",MAX(C13:D13))","v":" "},{"$f":"IF(OR(ISBLANK(C13),ISBLANK(#REF!)),\" \",RANK(E13,$E$3:$E$42,1))","v":" "}]
[12,null,null," ",{"$f":"IF(OR(ISBLANK(C14),ISBLANK(#REF!)),\" \",MAX(C14:D14))","v":" "},{"$f":"IF(OR(ISBLANK(C14),ISBLANK(#REF!)),\" \",RANK(E14,$E$3:$E$42,1))","v":" "}]
[13,null,null," ",{"$f":"IF(OR(ISBLANK(C15),ISBLANK(#REF!)),\" \",MAX(C15:D15))","v":" "},{"$f":"IF(OR(ISBLANK(C15),ISBLANK(#REF!)),\" \",RANK(E15,$E$3:$E$42,1))","v":" "}]
[14,null,null," ",{"$f":"IF(OR(ISBLANK(C16),ISBLANK(#REF!)),\" \",MAX(C16:D16))","v":" "},{"$f":"IF(OR(ISBLANK(C16),ISBLANK(#REF!)),\" \",RANK(E16,$E$3:$E$42,1))","v":" "}]
[15,null,null," ",{"$f":"IF(OR(ISBLANK(C17),ISBLANK(#REF!)),\" \",MAX(C17:D17))","v":" "},{"$f":"IF(OR(ISBLANK(C17),ISBLANK(#REF!)),\" \",RANK(E17,$E$3:$E$42,1))","v":" "}]
[16,null,null," ",{"$f":"IF(OR(ISBLANK(C18),ISBLANK(D18)),\" \",MAX(C18:D18))","v":" "},{"$f":"IF(OR(ISBLANK(C18),ISBLANK(#REF!)),\" \",RANK(E18,$E$3:$E$42,1))","v":" "}]
[17,null,null," "," ",{"$f":"IF(OR(ISBLANK(C19),ISBLANK(#REF!)),\" \",RANK(E19,$E$3:$E$42,1))","v":" "}]
[18,null,null," "," ",{"$f":"IF(OR(ISBLANK(C20),ISBLANK(#REF!)),\" \",RANK(E20,$E$3:$E$42,1))","v":" "}]
[19,null,null," "," ",{"$f":"IF(OR(ISBLANK(C21),ISBLANK(D21)),\" \",RANK(E21,$E$3:$E$42,1))","v":" "}]
[20,null,null," "," "," "]
[21,null,null," "," "," "]
[22,null,null," "," "," "]
[23,null,null," "," "," "]
[24,null,null," "," "," "]
[25,null,null," "," "," "]
[26,null,null," "," "," "]
[27,null,null," "," "," "]
[28,null,null," "," "," "]
[29,null,null," "," "," "]
[30,null,null," "," "," "]
[31,null,null," "," "," "]
[32,null,null," "," "," "]
[33,null,null," "," "," "]
[34,null,null," "," "," "]
[35,null,null," "," "," "]
[36,null,null," "," "," "]
[37,null,null," "," "," "]
[38,null,null," "," "," "]
[39,null,null," "," "," "]
[40,null,null," "," "," "]

{"sheet":"PS 8","index":4,"n_rows":42,"n_cols":9,"rows_kept":42,"cut":false,"hidden":false,"merged":[[0,0,0,1],[0,2,0,4],[0,5,0,6],[15,7,18,7]]}
[{"$f":"MIN(E3:E42)","v":37.83},null,{"$f":"INDIRECT(I3)","v":"Nemocnice Pe"},null,null,"MUŽI"]
["No.","TÝM","LEVÝ PROUD","PRAVÝ PROUD","CELKOVÝ ČAS","POŘADÍ","POZNÁMKA",null,{"$f":"MATCH(1,F3:F42,0)+2","v":3}]
[3,"Nemocnice Pe",37.83,36.93,{"$f":"IF(OR(ISBLANK(C3),ISBLANK(#REF!)),\" \",MAX(C3:D3))","v":37.83},{"$f":"IF(OR(ISBLANK(C3),ISBLANK(#REF!)),\" \",RANK(E3,$E$3:$E$42,1))","v":1},null,null,{"$f":"ADDRESS(I2,2)","v":"$B$3"}]
[2,"Služátky",40.15,38.36,{"$f":"IF(OR(ISBLANK(C4),ISBLANK(#REF!)),\" \",MAX(C4:D4))","v":40.15},{"$f":"IF(OR(ISBLANK(C4),ISBLANK(#REF!)),\" \",RANK(E4,$E$3:$E$42,1))","v":2}]
[1,"Hněvkovice",99,{"$f":"IF(ISBLANK(C5),\" \",C5)","v":99},{"$f":"IF(OR(ISBLANK(C5),ISBLANK(#REF!)),\" \",MAX(C5:D5))","v":99},{"$f":"IF(OR(ISBLANK(C5),ISBLANK(#REF!)),\" \",RANK(E5,$E$3:$E$42,1))","v":3}]
[4,null,null,{"$f":"IF(ISBLANK(C6),\" \",C6)","v":" "},{"$f":"IF(OR(ISBLANK(C6),ISBLANK(#REF!)),\" \",MAX(C6:D6))","v":" "},{"$f":"IF(OR(ISBLANK(C6),ISBLANK(#REF!)),\" \",RANK(E6,$E$3:$E$42,1))","v":" "}]
[5,null,null,{"$f":"IF(ISBLANK(C7),\" \",C7)","v":" "},{"$f":"IF(OR(ISBLANK(C7),ISBLANK(#REF!)),\" \",MAX(C7:D7))","v":" "},{"$f":"IF(OR(ISBLANK(C7),ISBLANK(#REF!)),\" \",RANK(E7,$E$3:$E$42,1))","v":" "}]
[6,null,null,{"$f":"IF(ISBLANK(C8),\" \",C8)","v":" "},{"$f":"IF(OR(ISBLANK(C8),ISBLANK(#REF!)),\" \",MAX(C8:D8))","v":" "},{"$f":"IF(OR(ISBLANK(C8),ISBLANK(#REF!)),\" \",RANK(E8,$E$3:$E$42,1))","v":" "}]
[7,null,null,{"$f":"IF(ISBLANK(C9),\" \",C9)","v":" "},{"$f":"IF(OR(ISBLANK(C9),ISBLANK(#REF!)),\" \",MAX(C9:D9))","v":" "},{"$f":"IF(OR(ISBLANK(C9),ISBLANK(#REF!)),\" \",RANK(E9,$E$3:$E$42,1))","v":" "}]
[8,null,null,{"$f":"IF(ISBLANK(C10),\" \",C10)","v":" "},{"$f":"IF(OR(ISBLANK(C10),ISBLANK(#REF!)),\" \",MAX(C10:D10))","v":" "},{"$f":"IF(OR(ISBLANK(C10),ISBLANK(#REF!)),\" \",RANK(E10,$E$3:$E$42,1))","v":" "}]
[9,null,null,{"$f":"IF(ISBLANK(C11),\" \",C11)","v":" "},{"$f":"IF(OR(ISBLANK(C11),ISBLANK(#REF!)),\" \",MAX(C11:D11))","v":" "},{"$f":"IF(OR(ISBLANK(C11),ISBLANK(#REF!)),\" \",RANK(E11,$E$3:$E$42,1))","v":" "}]
[10,null,null,{"$f":"IF(ISBLANK(C12),\" \",C12)","v":" "},{"$f":"IF(OR(ISBLANK(C12),ISBLANK(#REF!)),\" \",MAX(C12:D12))","v":" "},{"$f":"IF(OR(ISBLANK(C12),ISBLANK(#REF!)),\" \",RANK(E12,$E$3:$E$42,1))","v":" "}]
[11,null,null,{"$f":"IF(ISBLANK(C13),\" \",C13)","v":" "},{"$f":"IF(OR(ISBLANK(C13),ISBLANK(#REF!)),\" \",MAX(C13:D13))","v":" "},{"$f":"IF(OR(ISBLANK(C13),ISBLANK(#REF!)),\" \",RANK(E13,$E$3:$E$42,1))","v":" "}]
[12,null,null,{"$f":"IF(ISBLANK(C14),\" \",C14)","v":" "},{"$f":"IF(OR(ISBLANK(C14),ISBLANK(#REF!)),\" \",MAX(C14:D14))","v":" "},{"$f":"IF(OR(ISBLANK(C14),ISBLANK(#REF!)),\" \",RANK(E14,$E$3:$E$42,1))","v":" "}]
[13,null,null,{"$f":"IF(ISBLANK(C15),\" \",C15)","v":" "},{"$f":"IF(OR(ISBLANK(C15),ISBLANK(#REF!)),\" \",MAX(C15:D15))","v":" "},{"$f":"IF(OR(ISBLANK(C15),ISBLANK(#REF!)),\" \",RANK(E15,$E$3:$E$42,1))","v":" "}]
[14,null,null,{"$f":"IF(ISBLANK(C16),\" \",C16)","v":" "},{"$f":"IF(OR(ISBLANK(C16),ISBLANK(#REF!)),\" \",MAX(C16:D16))","v":" "},{"$f":"IF(OR(ISBLANK(C16),ISBLANK(#REF!)),\" \",RANK(E16,$E$3:$E$42,1))","v":" "}]
[15,null,null,{"$f":"IF(ISBLANK(C17),\" \",C17)","v":" "},{"$f":"IF(OR(ISBLANK(C17),ISBLANK(#REF!)),\" \",MAX(C17:D17))","v":" "},{"$f":"IF(OR(ISBLANK(C17),ISBLANK(#REF!)),\" \",RANK(E17,$E$3:$E$42,1))","v":" "}]
[16,null,null,{"$f":"IF(ISBLANK(C18),\" \",C18)","v":" "},{"$f":"IF(OR(ISBLANK(C18),ISBLANK(D18)),\" \",MAX(C18:D18))","v":" "},{"$f":"IF(OR(ISBLANK(C18),ISBLANK(#REF!)),\" \",RANK(E18,$E$3:$E$42,1))","v":" "}]
[17,null,null,{"$f":"IF(ISBLANK(C19),\" \",C19)","v":" "},{"$f":"IF(OR(ISBLANK(C19),ISBLANK(D19)),\" \",MAX(C19:D19))","v":" "},{"$f":"IF(OR(ISBLANK(C19),ISBLANK(#REF!)),\" \",RANK(E19,$E$3:$E$42,1))","v":" "}]
[18,null,null,{"$f":"IF(ISBLANK(C20),\" \",C20)","v":" "},{"$f":"IF(OR(ISBLANK(C20),ISBLANK(D20)),\" \",MAX(C20:D20))","v":" "},{"$f":"IF(OR(ISBLANK(C20),ISBLANK(#REF!)),\" \",RANK(E20,$E$3:$E$42,1))","v":" "}]
[19,null,null,{"$f":"IF(ISBLANK(C21),\" \",C21)","v":" "},{"$f":"IF(OR(ISBLANK(C21),ISBLANK(D21)),\" \",MAX(C21:D21))","v":" "},{"$f":"IF(OR(ISBLANK(C21),ISBLANK(D21)),\" \",RANK(E21,$E$3:$E$42,1))","v":" "}]
[20,null,null,{"$f":"IF(ISBLANK(C22),\" \",C22)","v":" "},{"$f":"IF(OR(ISBLANK(C22),ISBLANK(D22)),\" \",MAX(C22:D22))","v":" "},{"$f":"IF(OR(ISBLANK(C22),ISBLANK(D22)),\" \",RANK(E22,$E$3:$E$42,1))","v":" "}]
[21,null,null,{"$f":"IF(ISBLANK(C23),\" \",C23)","v":" "},{"$f":"IF(OR(ISBLANK(C23),ISBLANK(D23)),\" \",MAX(C23:D23))","v":" "},{"$f":"IF(OR(ISBLANK(C23),ISBLANK(D23)),\" \",RANK(E23,$E$3:$E$42,1))","v":" "}]
[22,null,null,{"$f":"IF(ISBLANK(C24),\" \",C24)","v":" "},{"$f":"IF(OR(ISBLANK(C24),ISBLANK(D24)),\" \",MAX(C24:D24))","v":" "},{"$f":"IF(OR(ISBLANK(C24),ISBLANK(D24)),\" \",RANK(E24,$E$3:$E$42,1))","v":" "}]
[23,null,null,{"$f":"IF(ISBLANK(C25),\" \",C25)","v":" "},{"$f":"IF(OR(ISBLANK(C25),ISBLANK(D25)),\" \",MAX(C25:D25))","v":" "},{"$f":"IF(OR(ISBLANK(C25),ISBLANK(D25)),\" \",RANK(E25,$E$3:$E$42,1))","v":" "}]
[24,null,null,{"$f":"IF(ISBLANK(C26),\" \",C26)","v":" "},{"$f":"IF(OR(ISBLANK(C26),ISBLANK(D26)),\" \",MAX(C26:D26))","v":" "},{"$f":"IF(OR(ISBLANK(C26),ISBLANK(D26)),\" \",RANK(E26,$E$3:$E$42,1))","v":" "}]
[25,null,null,{"$f":"IF(ISBLANK(C27),\" \",C27)","v":" "},{"$f":"IF(OR(ISBLANK(C27),ISBLANK(D27)),\" \",MAX(C27:D27))","v":" "},{"$f":"IF(OR(ISBLANK(C27),ISBLANK(D27)),\" \",RANK(E27,$E$3:$E$42,1))","v":" "}]
[26,null,null,{"$f":"IF(ISBLANK(C28),\" \",C28)","v":" "},{"$f":"IF(OR(ISBLANK(C28),ISBLANK(D28)),\" \",MAX(C28:D28))","v":" "},{"$f":"IF(OR(ISBLANK(C28),ISBLANK(D28)),\" \",RANK(E28,$E$3:$E$42,1))","v":" "}]
[27,null,null,{"$f":"IF(ISBLANK(C29),\" \",C29)","v":" "},{"$f":"IF(OR(ISBLANK(C29),ISBLANK(D29)),\" \",MAX(C29:D29))","v":" "},{"$f":"IF(OR(ISBLANK(C29),ISBLANK(D29)),\" \",RANK(E29,$E$3:$E$42,1))","v":" "}]
[28,null,null,{"$f":"IF(ISBLANK(C30),\" \",C30)","v":" "},{"$f":"IF(OR(ISBLANK(C30),ISBLANK(D30)),\" \",MAX(C30:D30))","v":" "},{"$f":"IF(OR(ISBLANK(C30),ISBLANK(D30)),\" \",RANK(E30,$E$3:$E$42,1))","v":" "}]
[29,null,null,{"$f":"IF(ISBLANK(C31),\" \",C31)","v":" "},{"$f":"IF(OR(ISBLANK(C31),ISBLANK(D31)),\" \",MAX(C31:D31))","v":" "},{"$f":"IF(OR(ISBLANK(C31),ISBLANK(D31)),\" \",RANK(E31,$E$3:$E$42,1))","v":" "}]
[30,null,null,{"$f":"IF(ISBLANK(C32),\" \",C32)","v":" "},{"$f":"IF(OR(ISBLANK(C32),ISBLANK(D32)),\" \",MAX(C32:D32))","v":" "},{"$f":"IF(OR(ISBLANK(C32),ISBLANK(D32)),\" \",RANK(E32,$E$3:$E$42,1))","v":" "}]
[31,null,null,{"$f":"IF(ISBLANK(C33),\" \",C33)","v":" "},{"$f":"IF(OR(ISBLANK(C33),ISBLANK(D33)),\" \",MAX(C33:D33))","v":" "},{"$f":"IF(OR(ISBLANK(C33),ISBLANK(D33)),\" \",RANK(E33,$E$3:$E$42,1))","v":" "}]
[32,null,null,{"$f":"IF(ISBLANK(C34),\" \",C34)","v":" "},{"$f":"IF(OR(ISBLANK(C34),ISBLANK(D34)),\" \",MAX(C34:D34))","v":" "},{"$f":"IF(OR(ISBLANK(C34),ISBLANK(D34)),\" \",RANK(E34,$E$3:$E$42,1))","v":" "}]
[33,null,null,{"$f":"IF(ISBLANK(C35),\" \",C35)","v":" "},{"$f":"IF(OR(ISBLANK(C35),ISBLANK(D35)),\" \",MAX(C35:D35))","v":" "},{"$f":"IF(OR(ISBLANK(C35),ISBLANK(D35)),\" \",RANK(E35,$E$3:$E$42,1))","v":" "}]
[34,null,null,{"$f":"IF(ISBLANK(C36),\" \",C36)","v":" "},{"$f":"IF(OR(ISBLANK(C36),ISBLANK(D36)),\" \",MAX(C36:D36))","v":" "},{"$f":"IF(OR(ISBLANK(C36),ISBLANK(D36)),\" \",RANK(E36,$E$3:$E$42,1))","v":" "}]
[35,null,null,{"$f":"IF(ISBLANK(C37),\" \",C37)","v":" "},{"$f":"IF(OR(ISBLANK(C37),ISBLANK(D37)),\" \",MAX(C37:D37))","v":" "},{"$f":"IF(OR(ISBLANK(C37),ISBLANK(D37)),\" \",RANK(E37,$E$3:$E$42,1))","v":" "}]
[36,null,null,{"$f":"IF(ISBLANK(C38),\" \",C38)","v":" "},{"$f":"IF(OR(ISBLANK(C38),ISBLANK(D38)),\" \",MAX(C38:D38))","v":" "},{"$f":"IF(OR(ISBLANK(C38),ISBLANK(D38)),\" \",RANK(E38,$E$3:$E$42,1))","v":" "}]
[37,null,null,{"$f":"IF(ISBLANK(C39),\" \",C39)","v":" "},{"$f":"IF(OR(ISBLANK(C39),ISBLANK(D39)),\" \",MAX(C39:D39))","v":" "},{"$f":"IF(OR(ISBLANK(C39),ISBLANK(D39)),\" \",RANK(E39,$E$3:$E$42,1))","v":" "}]
[38,null,null,{"$f":"IF(ISBLANK(C40),\" \",C40)","v":" "},{"$f":"IF(OR(ISBLANK(C40),ISBLANK(D40)),\" \",MAX(C40:D40))","v":" "},{"$f":"IF(OR(ISBLANK(C40),ISBLANK(D40)),\" \",RANK(E40,$E$3:$E$42,1))","v":" "}]
[39,null,null,{"$f":"IF(ISBLANK(C41),\" \",C41)","v":" "},{"$f":"IF(OR(ISBLANK(C41),ISBLANK(D41)),\" \",MAX(C41:D41))","v":" "},{"$f":"IF(OR(ISBLANK(C41),ISBLANK(D41)),\" \",RANK(E41,$E$3:$E$42,1))","v":" "}]
[40,null,null,{"$f":"IF(ISBLANK(C42),\" \",C42)","v":" "},{"$f":"IF(OR(ISBLANK(C42),ISBLANK(D42)),\" \",MAX(C42:D42))","v":" "},{"$f":"IF(OR(ISBLANK(C42),ISBLANK(D42)),\" \",RANK(E42,$E$3:$E$42,1))","v":" "}]

{"sheet":"PLAY OFF","index":5,"n_rows":9,"n_cols":8,"rows_kept":9,"cut":false,"hidden":false,"merged":[[1,7,8,7],[1,2,2,2],[3,2,4,2],[5,2,6,2],[7,2,8,2],[1,3,2,3],[3,3,4,3],[5,3,6,3],[7,3,8,3],[1,4,4,4],[1,5,4,5],[5,4,8,4],[5,5,8,5],[1,6,8,6]]}
["TÝM","ČAS","TÝM","ČAS","TÝM","ČAS","TÝM","ČAS"]
["Kletečná B",19.11,"Kletečná B",18.87,"Kletečná B",18.93,"Kletečná B",{"$f":"MIN(F2,F6)","v":18.93}]
["Hněvkovice B",99]
["Přáslavice B",19.14,"Přáslavice B",19.43]
["Jiřice A",99]
["Přáslavice A",20.57,"Salačova Lhota",19.14,"Salačova Lhota",99]
["Salačova Lhota",18.28]
["Hněvkovice ženy",26.78,"Hněvkovice ženy",29.06]
["Jiřice ženy",99]

{"sheet":"CELKOVÁ","index":6,"n_rows":23,"n_cols":11,"rows_kept":23,"cut":false,"hidden":false,"merged":[[0,0,2,0],[0,9,1,10],[1,1,1,2],[1,3,1,4],[1,5,1,6],[0,1,0,4],[1,7,1,8],[0,5,0,8]]}
["POŘADÍ","PHL",null,null,null,"MIMO PHL",null,null,null,"PS 8"]
[null,"MUŽI",null,"ŽENY",null,"MUŽI",null,"ŽENY"]
[null,"MUŽSTVO","ČAS","MUŽSTVO","ČAS","MUŽSTVO","ČAS","MUŽSTVO","ČAS","MUŽSTVO","ČAS"]
[1,{"$f":"IF(ISBLANK('MUŽI PHL'!B3),\" \",'MUŽI PHL'!B3)","v":"Kletečná B"},{"$f":"'MUŽI PHL'!E3","v":18.850000000000001},{"$f":"IF(ISBLANK('ŽENY PHL'!B3),\" \",'ŽENY PHL'!B3)","v":"  "},{"$f":"'ŽENY PHL'!E3","v":0},{"$f":"IF(ISBLANK('MUŽI MIMO PHL'!B3),\" \",'MUŽI MIMO PHL'!B3)","v":"Hněvkovice B"},{"$f":"'MUŽI MIMO PHL'!E3","v":22.81},{"$f":"IF(ISBLANK('ŽENY MIMO PHL'!B3),\" \",'ŽENY MIMO PHL'!B3)","v":"Hněvkovice"},{"$f":"'ŽENY MIMO PHL'!E3","v":27.28},{"$f":"IF(ISBLANK('PS 8'!B3),\" \",'PS 8'!B3)","v":"Nemocnice Pe"},{"$f":"'PS 8'!E3","v":37.83}]
[2,{"$f":"IF(ISBLANK('MUŽI PHL'!B4),\" \",'MUŽI PHL'!B4)","v":"Přáslavice A"},{"$f":"'MUŽI PHL'!E4","v":19.22},{"$f":"IF(ISBLANK('ŽENY PHL'!B4),\" \",'ŽENY PHL'!B4)","v":" "},{"$f":"'ŽENY PHL'!E4","v":" "},{"$f":"IF(ISBLANK('MUŽI MIMO PHL'!B4),\" \",'MUŽI MIMO PHL'!B4)","v":"Putimov"},{"$f":"'MUŽI MIMO PHL'!E4","v":99},{"$f":"IF(ISBLANK('ŽENY MIMO PHL'!B4),\" \",'ŽENY MIMO PHL'!B4)","v":"Jiřice"},{"$f":"'ŽENY MIMO PHL'!E4","v":27.65},{"$f":"IF(ISBLANK('PS 8'!B4),\" \",'PS 8'!B4)","v":"Služátky"},{"$f":"'PS 8'!E4","v":40.15}]
[3,{"$f":"IF(ISBLANK('MUŽI PHL'!B5),\" \",'MUŽI PHL'!B5)","v":"Přáslavice B"},{"$f":"'MUŽI PHL'!E5","v":19.489999999999998},{"$f":"IF(ISBLANK('ŽENY PHL'!B5),\" \",'ŽENY PHL'!B5)","v":" "},{"$f":"'ŽENY PHL'!E5","v":" "},{"$f":"IF(ISBLANK('MUŽI MIMO PHL'!B5),\" \",'MUŽI MIMO PHL'!B5)","v":"Horní Němčice"},{"$f":"'MUŽI MIMO PHL'!E5","v":99.9},{"$f":"IF(ISBLANK('ŽENY MIMO PHL'!B5),\" \",'ŽENY MIMO PHL'!B5)","v":" "},{"$f":"'ŽENY MIMO PHL'!E5","v":" "},{"$f":"IF(ISBLANK('PS 8'!B5),\" \",'PS 8'!B5)","v":"Hněvkovice"},{"$f":"'PS 8'!E5","v":99}]
[4,{"$f":"IF(ISBLANK('MUŽI PHL'!B6),\" \",'MUŽI PHL'!B6)","v":"Jiřice A"},{"$f":"'MUŽI PHL'!E6","v":19.5},{"$f":"IF(ISBLANK('ŽENY PHL'!B6),\" \",'ŽENY PHL'!B6)","v":" "},{"$f":"'ŽENY PHL'!E6","v":" "},{"$f":"IF(ISBLANK('MUŽI MIMO PHL'!B6),\" \",'MUŽI MIMO PHL'!B6)","v":" "},{"$f":"'MUŽI MIMO PHL'!E6","v":" "},{"$f":"IF(ISBLANK('ŽENY MIMO PHL'!B6),\" \",'ŽENY MIMO PHL'!B6)","v":" "},{"$f":"'ŽENY MIMO PHL'!E6","v":" "},{"$f":"IF(ISBLANK('PS 8'!B6),\" \",'PS 8'!B6)","v":" "},{"$f":"'PS 8'!E6","v":" "}]
[5,{"$f":"IF(ISBLANK('MUŽI PHL'!B7),\" \",'MUŽI PHL'!B7)","v":"Salačova Lhota"},{"$f":"'MUŽI PHL'!E7","v":20.190000000000001},{"$f":"IF(ISBLANK('ŽENY PHL'!B7),\" \",'ŽENY PHL'!B7)","v":" "},{"$f":"'ŽENY PHL'!E7","v":" "},{"$f":"IF(ISBLANK('MUŽI MIMO PHL'!B7),\" \",'MUŽI MIMO PHL'!B7)","v":" "},{"$f":"'MUŽI MIMO PHL'!E7","v":" "},{"$f":"IF(ISBLANK('ŽENY MIMO PHL'!B7),\" \",'ŽENY MIMO PHL'!B7)","v":" "},{"$f":"'ŽENY MIMO PHL'!E7","v":" "},{"$f":"IF(ISBLANK('PS 8'!B7),\" \",'PS 8'!B7)","v":" "},{"$f":"'PS 8'!E7","v":" "}]
[6,{"$f":"IF(ISBLANK('MUŽI PHL'!B8),\" \",'MUŽI PHL'!B8)","v":"Bácovice"},{"$f":"'MUŽI PHL'!E8","v":20.41},{"$f":"IF(ISBLANK('ŽENY PHL'!B8),\" \",'ŽENY PHL'!B8)","v":" "},{"$f":"'ŽENY PHL'!E8","v":" "},{"$f":"IF(ISBLANK('MUŽI MIMO PHL'!B8),\" \",'MUŽI MIMO PHL'!B8)","v":" "},{"$f":"'MUŽI MIMO PHL'!E8","v":" "},{"$f":"IF(ISBLANK('ŽENY MIMO PHL'!B8),\" \",'ŽENY MIMO PHL'!B8)","v":" "},{"$f":"'ŽENY MIMO PHL'!E8","v":" "},{"$f":"IF(ISBLANK('PS 8'!B8),\" \",'PS 8'!B8)","v":" "},{"$f":"'PS 8'!E8","v":" "}]
[7,{"$f":"IF(ISBLANK('MUŽI PHL'!B9),\" \",'MUŽI PHL'!B9)","v":"Červená Řečice"},{"$f":"'MUŽI PHL'!E9","v":20.55},{"$f":"IF(ISBLANK('ŽENY PHL'!B9),\" \",'ŽENY PHL'!B9)","v":" "},{"$f":"'ŽENY PHL'!E9","v":" "},{"$f":"IF(ISBLANK('MUŽI MIMO PHL'!B9),\" \",'MUŽI MIMO PHL'!B9)","v":" "},{"$f":"'MUŽI MIMO PHL'!E9","v":" "},{"$f":"IF(ISBLANK('ŽENY MIMO PHL'!B9),\" \",'ŽENY MIMO PHL'!B9)","v":" "},{"$f":"'ŽENY MIMO PHL'!E9","v":" "},{"$f":"IF(ISBLANK('PS 8'!B9),\" \",'PS 8'!B9)","v":" "},{"$f":"'PS 8'!E9","v":" "}]
[8,{"$f":"IF(ISBLANK('MUŽI PHL'!B10),\" \",'MUŽI PHL'!B10)","v":"Kletečná A"},{"$f":"'MUŽI PHL'!E10","v":20.78},{"$f":"IF(ISBLANK('ŽENY PHL'!B10),\" \",'ŽENY PHL'!B10)","v":" "},{"$f":"'ŽENY PHL'!E10","v":" "},{"$f":"IF(ISBLANK('MUŽI MIMO PHL'!B10),\" \",'MUŽI MIMO PHL'!B10)","v":" "},{"$f":"'MUŽI MIMO PHL'!E10","v":" "},{"$f":"IF(ISBLANK('ŽENY MIMO PHL'!B10),\" \",'ŽENY MIMO PHL'!B10)","v":" "},{"$f":"'ŽENY MIMO PHL'!E10","v":" "},{"$f":"IF(ISBLANK('PS 8'!B10),\" \",'PS 8'!B10)","v":" "},{"$f":"'PS 8'!E10","v":" "}]
[9,{"$f":"IF(ISBLANK('MUŽI PHL'!B11),\" \",'MUŽI PHL'!B11)","v":"Jiřice B"},{"$f":"'MUŽI PHL'!E11","v":25.55},{"$f":"IF(ISBLANK('ŽENY PHL'!B11),\" \",'ŽENY PHL'!B11)","v":" "},{"$f":"'ŽENY PHL'!E11","v":" "},{"$f":"IF(ISBLANK('MUŽI MIMO PHL'!B11),\" \",'MUŽI MIMO PHL'!B11)","v":" "},{"$f":"'MUŽI MIMO PHL'!E11","v":" "},{"$f":"IF(ISBLANK('ŽENY MIMO PHL'!B11),\" \",'ŽENY MIMO PHL'!B11)","v":" "},{"$f":"'ŽENY MIMO PHL'!E11","v":" "},{"$f":"IF(ISBLANK('PS 8'!B11),\" \",'PS 8'!B11)","v":" "},{"$f":"'PS 8'!E11","v":" "}]
[10,{"$f":"IF(ISBLANK('MUŽI PHL'!B12),\" \",'MUŽI PHL'!B12)","v":"Samšín"},{"$f":"'MUŽI PHL'!E12","v":37.840000000000003},{"$f":"IF(ISBLANK('ŽENY PHL'!B12),\" \",'ŽENY PHL'!B12)","v":" "},{"$f":"'ŽENY PHL'!E12","v":" "},{"$f":"IF(ISBLANK('MUŽI MIMO PHL'!B12),\" \",'MUŽI MIMO PHL'!B12)","v":" "},{"$f":"'MUŽI MIMO PHL'!E12","v":" "},{"$f":"IF(ISBLANK('ŽENY MIMO PHL'!B12),\" \",'ŽENY MIMO PHL'!B12)","v":" "},{"$f":"'ŽENY MIMO PHL'!E12","v":" "},{"$f":"IF(ISBLANK('PS 8'!B12),\" \",'PS 8'!B12)","v":" "},{"$f":"'PS 8'!E12","v":" "}]
[11,{"$f":"IF(ISBLANK('MUŽI PHL'!B13),\" \",'MUŽI PHL'!B13)","v":"Hněvkovice A"},{"$f":"'MUŽI PHL'!E13","v":99},{"$f":"IF(ISBLANK('ŽENY PHL'!B13),\" \",'ŽENY PHL'!B13)","v":" "},{"$f":"'ŽENY PHL'!E13","v":" "},{"$f":"IF(ISBLANK('MUŽI MIMO PHL'!B13),\" \",'MUŽI MIMO PHL'!B13)","v":" "},{"$f":"'MUŽI MIMO PHL'!E13","v":" "},{"$f":"IF(ISBLANK('ŽENY MIMO PHL'!B13),\" \",'ŽENY MIMO PHL'!B13)","v":" "},{"$f":"'ŽENY MIMO PHL'!E13","v":" "},{"$f":"IF(ISBLANK('PS 8'!B13),\" \",'PS 8'!B13)","v":" "},{"$f":"'PS 8'!E13","v":" "}]
[12,{"$f":"IF(ISBLANK('MUŽI PHL'!B14),\" \",'MUŽI PHL'!B14)","v":"Pacov"},{"$f":"'MUŽI PHL'!E14","v":99.5},{"$f":"IF(ISBLANK('ŽENY PHL'!B14),\" \",'ŽENY PHL'!B14)","v":" "},{"$f":"'ŽENY PHL'!E14","v":" "},{"$f":"IF(ISBLANK('MUŽI MIMO PHL'!B14),\" \",'MUŽI MIMO PHL'!B14)","v":" "},{"$f":"'MUŽI MIMO PHL'!E14","v":" "},{"$f":"IF(ISBLANK('ŽENY MIMO PHL'!B14),\" \",'ŽENY MIMO PHL'!B14)","v":" "},{"$f":"'ŽENY MIMO PHL'!E14","v":" "},{"$f":"IF(ISBLANK('PS 8'!B14),\" \",'PS 8'!B14)","v":" "},{"$f":"'PS 8'!E14","v":" "}]
[13,{"$f":"IF(ISBLANK('MUŽI PHL'!B15),\" \",'MUŽI PHL'!B15)","v":" "},{"$f":"'MUŽI PHL'!E15","v":" "},{"$f":"IF(ISBLANK('ŽENY PHL'!B15),\" \",'ŽENY PHL'!B15)","v":" "},{"$f":"'ŽENY PHL'!E15","v":" "},{"$f":"IF(ISBLANK('MUŽI MIMO PHL'!B15),\" \",'MUŽI MIMO PHL'!B15)","v":" "},{"$f":"'MUŽI MIMO PHL'!E15","v":" "},{"$f":"IF(ISBLANK('ŽENY MIMO PHL'!B15),\" \",'ŽENY MIMO PHL'!B15)","v":" "},{"$f":"'ŽENY MIMO PHL'!E15","v":" "},{"$f":"IF(ISBLANK('PS 8'!B15),\" \",'PS 8'!B15)","v":" "},{"$f":"'PS 8'!E15","v":" "}]
[14,{"$f":"IF(ISBLANK('MUŽI PHL'!B16),\" \",'MUŽI PHL'!B16)","v":" "},{"$f":"'MUŽI PHL'!E16","v":" "},{"$f":"IF(ISBLANK('ŽENY PHL'!B16),\" \",'ŽENY PHL'!B16)","v":" "},{"$f":"'ŽENY PHL'!E16","v":" "},{"$f":"IF(ISBLANK('MUŽI MIMO PHL'!B16),\" \",'MUŽI MIMO PHL'!B16)","v":" "},{"$f":"'MUŽI MIMO PHL'!E16","v":" "},{"$f":"IF(ISBLANK('ŽENY MIMO PHL'!B16),\" \",'ŽENY MIMO PHL'!B16)","v":" "},{"$f":"'ŽENY MIMO PHL'!E16","v":" "},{"$f":"IF(ISBLANK('PS 8'!B16),\" \",'PS 8'!B16)","v":" "},{"$f":"'PS 8'!E16","v":" "}]
[15,{"$f":"IF(ISBLANK('MUŽI PHL'!B17),\" \",'MUŽI PHL'!B17)","v":" "},{"$f":"'MUŽI PHL'!E17","v":" "},{"$f":"IF(ISBLANK('ŽENY PHL'!B17),\" \",'ŽENY PHL'!B17)","v":" "},{"$f":"'ŽENY PHL'!E17","v":" "},{"$f":"IF(ISBLANK('MUŽI MIMO PHL'!B17),\" \",'MUŽI MIMO PHL'!B17)","v":" "},{"$f":"'MUŽI MIMO PHL'!E17","v":" "},{"$f":"IF(ISBLANK('ŽENY MIMO PHL'!B17),\" \",'ŽENY MIMO PHL'!B17)","v":" "},{"$f":"'ŽENY MIMO PHL'!E17","v":" "},{"$f":"IF(ISBLANK('PS 8'!B17),\" \",'PS 8'!B17)","v":" "},{"$f":"'PS 8'!E17","v":" "}]
[16,{"$f":"IF(ISBLANK('MUŽI PHL'!B18),\" \",'MUŽI PHL'!B18)","v":" "},{"$f":"'MUŽI PHL'!E18","v":" "},{"$f":"IF(ISBLANK('ŽENY PHL'!B18),\" \",'ŽENY PHL'!B18)","v":" "},{"$f":"'ŽENY PHL'!E18","v":" "},{"$f":"IF(ISBLANK('MUŽI MIMO PHL'!B18),\" \",'MUŽI MIMO PHL'!B18)","v":" "},{"$f":"'MUŽI MIMO PHL'!E18","v":" "},{"$f":"IF(ISBLANK('ŽENY MIMO PHL'!B18),\" \",'ŽENY MIMO PHL'!B18)","v":" "},{"$f":"'ŽENY MIMO PHL'!E18","v":" "},{"$f":"IF(ISBLANK('PS 8'!B18),\" \",'PS 8'!B18)","v":" "},{"$f":"'PS 8'!E18","v":" "}]
[17,{"$f":"IF(ISBLANK('MUŽI PHL'!B19),\" \",'MUŽI PHL'!B19)","v":" "},{"$f":"'MUŽI PHL'!E19","v":" "},{"$f":"IF(ISBLANK('ŽENY PHL'!B19),\" \",'ŽENY PHL'!B19)","v":" "},{"$f":"'ŽENY PHL'!E19","v":" "},{"$f":"IF(ISBLANK('MUŽI MIMO PHL'!B19),\" \",'MUŽI MIMO PHL'!B19)","v":" "},{"$f":"'MUŽI MIMO PHL'!E19","v":" "},{"$f":"IF(ISBLANK('ŽENY MIMO PHL'!B19),\" \",'ŽENY MIMO PHL'!B19)","v":" "},{"$f":"'ŽENY MIMO PHL'!E19","v":" "},{"$f":"IF(ISBLANK('PS 8'!B19),\" \",'PS 8'!B19)","v":" "},{"$f":"'PS 8'!E19","v":" "}]
[18,{"$f":"IF(ISBLANK('MUŽI PHL'!B20),\" \",'MUŽI PHL'!B20)","v":" "},{"$f":"'MUŽI PHL'!E20","v":" "},{"$f":"IF(ISBLANK('ŽENY PHL'!B20),\" \",'ŽENY PHL'!B20)","v":" "},{"$f":"'ŽENY PHL'!E20","v":" "},{"$f":"IF(ISBLANK('MUŽI MIMO PHL'!B20),\" \",'MUŽI MIMO PHL'!B20)","v":" "},{"$f":"'MUŽI MIMO PHL'!E20","v":" "},{"$f":"IF(ISBLANK('ŽENY MIMO PHL'!B20),\" \",'ŽENY MIMO PHL'!B20)","v":" "},{"$f":"'ŽENY MIMO PHL'!E20","v":" "},{"$f":"IF(ISBLANK('PS 8'!B20),\" \",'PS 8'!B20)","v":" "},{"$f":"'PS 8'!E20","v":" "}]
[19,{"$f":"IF(ISBLANK('MUŽI PHL'!B21),\" \",'MUŽI PHL'!B21)","v":" "},{"$f":"'MUŽI PHL'!E21","v":" "},{"$f":"IF(ISBLANK('ŽENY PHL'!B21),\" \",'ŽENY PHL'!B21)","v":" "},{"$f":"'ŽENY PHL'!E21","v":" "},{"$f":"IF(ISBLANK('MUŽI MIMO PHL'!B21),\" \",'MUŽI MIMO PHL'!B21)","v":" "},{"$f":"'MUŽI MIMO PHL'!E21","v":" "},{"$f":"IF(ISBLANK('ŽENY MIMO PHL'!B21),\" \",'ŽENY MIMO PHL'!B21)","v":" "},{"$f":"'ŽENY MIMO PHL'!E21","v":" "},{"$f":"IF(ISBLANK('PS 8'!B21),\" \",'PS 8'!B21)","v":" "},{"$f":"'PS 8'!E21","v":" "}]
[20,{"$f":"IF(ISBLANK('MUŽI PHL'!B22),\" \",'MUŽI PHL'!B22)","v":" "},{"$f":"'MUŽI PHL'!E22","v":" "},{"$f":"IF(ISBLANK('ŽENY PHL'!B22),\" \",'ŽENY PHL'!B22)","v":" "},{"$f":"'ŽENY PHL'!E22","v":" "},{"$f":"IF(ISBLANK('MUŽI MIMO PHL'!B22),\" \",'MUŽI MIMO PHL'!B22)","v":" "},{"$f":"'MUŽI MIMO PHL'!E22","v":" "},{"$f":"IF(ISBLANK('ŽENY MIMO PHL'!B22),\" \",'ŽENY MIMO PHL'!B22)","v":" "},{"$f":"'ŽENY MIMO PHL'!E22","v":" "},{"$f":"IF(ISBLANK('PS 8'!B22),\" \",'PS 8'!B22)","v":" "},{"$f":"'PS 8'!E22","v":" "}]

{"sheet":"List1","index":7,"n_rows":51,"n_cols":3,"rows_kept":51,"cut":false,"hidden":false,"merged":[]}
["POŘADÍ","TÝM","POZNÁMKA"]
[1]
[2]
[3]
[4]
[5]
[6]
[7]
[8]
[9]
[10]
[11]
[12]
[13]
[14]
[15]
[16]
[17]
[18]
[19]
[20]
[21]
[22]
[23]
[24]
[25]
[26]
[27]
[28]
[29]
[30]
[31]
[32]
[33]
[34]
[35]
[36]
[37]
[38]
[39]
[40]
[41]
[42]
[43]
[44]
[45]
[46]
[47]
[48]
[49]
[50]